Target
Cholinesterase
Ligand
BDBM91728
Substrate
Meas. Tech.
Inhibition Assay
pH
7.4±0
Temperature
310.15±0 K
IC50
5.5620e+7± 9.86e+5 nM
Kd
7.6804e+7± 2.41e+5 nM
Citation
 Gholivand, KAbdollahi, MMojahed, FAlizadehgan, AMDehghan, G Acetylcholinesterase/butyrylcholinesterase inhibition activity of some new carbacylamidophosphate derivatives. J Enzyme Inhib Med Chem 24:566-76 (2009)  
Target
Name:
Cholinesterase
Synonyms:
Acylcholine acylhydrolase Butyrylcholine esterase (BChE) Butyrylcholinesterase (BuChE) CHLE_HUMAN Cholinesterases Pseudocholinesterase
Type:
Homotetramer
Mol. Mass.:
68422.27
Organism:
Homo sapiens (Human)
Description:
P06276
Residue:
602
  
Inhibitor
Name:
BDBM91728
Synonyms:
Carbacylamidophosphate, 3b
Type:
Small organic molecule
Emp. Form.:
C15H22N3O4P
Mol. Mass.:
339.3266
SMILES:
O=C(NP(=O)(N1CCOCC1)N1CCOCC1)c1ccccc1
: