Target
Cholinesterase
Ligand
BDBM91730
Substrate
Meas. Tech.
Inhibition Assay
pH
7.4±0
Temperature
310.15±0 K
IC50
1.6720e+7± 2.74e+5 nM
Kd
3.3557e+7± 1.63e+5 nM
Citation
 Gholivand, KAbdollahi, MMojahed, FAlizadehgan, AMDehghan, G Acetylcholinesterase/butyrylcholinesterase inhibition activity of some new carbacylamidophosphate derivatives. J Enzyme Inhib Med Chem 24:566-76 (2009)  
Target
Name:
Cholinesterase
Synonyms:
Acylcholine acylhydrolase Butyrylcholine esterase (BChE) Butyrylcholinesterase (BuChE) CHLE_HUMAN Cholinesterases Pseudocholinesterase
Type:
Homotetramer
Mol. Mass.:
68422.27
Organism:
Homo sapiens (Human)
Description:
P06276
Residue:
602
  
Inhibitor
Name:
BDBM91730
Synonyms:
Carbacylamidophosphate, 4b
Type:
Small organic molecule
Emp. Form.:
C16H24N3O4P
Mol. Mass.:
353.3532
SMILES:
Cc1ccc(cc1)C(=O)NP(=O)(N1CCOCC1)N1CCOCC1
: