Target
Cyclin-A2/Cyclin-dependent kinase 2
Ligand
BDBM8069
Substrate
Meas. Tech.
OctetRed
pH
7.5±n/a
Temperature
298.15±n/a K
Kd
190±37 nM
Citation
 CSARdock, CD CDK2-CyclinA in CSAR_FULL_RELEASE_3JULY2012 CSAR 1:0 (2012)  
Target
Name:
Cyclin-A2/Cyclin-dependent kinase 2
Synonyms:
CDK2-CyclinA CDK2/Cyclin A Cyclin A2/dependent kinase 2 Cyclin-Dependent Kinase 2 (CDK2A)
Type:
Protein Complex
Mol. Mass.:
Description:
Cdk2/Cyclin A kinase was purified from insect cells coinfected with Cyclin A/Cdk2 baculovirus.
Components:
This complex has 2 components.
Component 1
Name:
Cyclin-dependent kinase 2
Synonyms:
CDK2 CDK2_HUMAN Cell division protein kinase 2 Protein cereblon/Cyclin-dependent kinase 2 | p33 protein kinase
Type:
Enzyme Subunit
Mol. Mass.:
33938.17
Organism:
Homo sapiens (Human)
Description:
P24941
Residue:
298
  
Component 2
Name:
Cyclin-A2
Synonyms:
CCN1 CCNA1 CCNA2_HUMAN Cyclin-A
Type:
Enzyme Subunit
Mol. Mass.:
48550.19
Organism:
Homo sapiens (Human)
Description:
P20248
Residue:
432
  
Inhibitor
Name:
BDBM8069
Synonyms:
2-Anilino-4-(thiazol-5-yl)pyrimidine deriv. 40 CS18 | N-[4-(2-Amino-4-methyl-thiazol-5-yl)-pyrimidin-2-yl]-N, N-dimethylbenzene-1,4-diamine
Type:
Small organic molecule
Emp. Form.:
C16H18N6S
Mol. Mass.:
326.419
SMILES:
CN(C)c1ccc(Nc2nccc(n2)-c2sc(N)nc2C)cc1
: