Target
Cyclin-A2/Cyclin-dependent kinase 2
Ligand
BDBM8043
Substrate
Meas. Tech.
OctetRed
pH
7.5±n/a
Temperature
298.15±n/a K
Kd
151±56 nM
Citation
 CSARdock, CD CDK2-CyclinA in CSAR_FULL_RELEASE_3JULY2012 CSAR 1:0 (2012)  
Target
Name:
Cyclin-A2/Cyclin-dependent kinase 2
Synonyms:
CDK2-CyclinA CDK2/Cyclin A Cyclin A2/dependent kinase 2 Cyclin-Dependent Kinase 2 (CDK2A)
Type:
Protein Complex
Mol. Mass.:
Description:
Cdk2/Cyclin A kinase was purified from insect cells coinfected with Cyclin A/Cdk2 baculovirus.
Components:
This complex has 2 components.
Component 1
Name:
Cyclin-dependent kinase 2
Synonyms:
CDK2 CDK2_HUMAN Cell division protein kinase 2 Protein cereblon/Cyclin-dependent kinase 2 | p33 protein kinase
Type:
Enzyme Subunit
Mol. Mass.:
33938.17
Organism:
Homo sapiens (Human)
Description:
P24941
Residue:
298
  
Component 2
Name:
Cyclin-A2
Synonyms:
CCN1 CCNA1 CCNA2_HUMAN Cyclin-A
Type:
Enzyme Subunit
Mol. Mass.:
48550.19
Organism:
Homo sapiens (Human)
Description:
P20248
Residue:
432
  
Inhibitor
Name:
BDBM8043
Synonyms:
(4-chlorophenyl)-[4-(2,4-dimethylthiazol-5-yl)pyrimidin-2-yl]amine CS13 | N-(4-chlorophenyl)-4-(2,4-dimethyl-1,3-thiazol-5-yl)pyrimidin-2-amine
Type:
Small organic molecule
Emp. Form.:
C15H13ClN4S
Mol. Mass.:
316.809
SMILES:
Cc1nc(C)c(s1)-c1ccnc(Nc2ccc(Cl)cc2)n1
: