Target
Serine/threonine-protein kinase Chk1
Ligand
BDBM91954
Substrate
Meas. Tech.
Abbott Kinase Enzymatics_CHK1/289 CDC25c
IC50
10000±n/a nM
Citation
 CSARdock, CD CHK1 in CSAR_FULL_RELEASE_3JULY2012 CSAR 1:0 (2012)  
Target
Name:
Serine/threonine-protein kinase Chk1
Synonyms:
CHEK1 CHK1 checkpoint homolog Checkpoint kinase-1 (CHK1)
Type:
Enzyme Catalytic Domain
Mol. Mass.:
54443.02
Organism:
Homo sapiens (Human)
Description:
gi_166295192
Residue:
476
  
Inhibitor
Name:
BDBM91954
Synonyms:
Chk1_86
Type:
Emp. Form.:
C23H16N2O3
Mol. Mass.:
368.3847
SMILES:
COc1cc(ccc1O)-c1ccc(cc1)-c1[nH]nc2-c3ccccc3C(=O)c12
: