Target
Serum paraoxonase/arylesterase 1
Ligand
BDBM50022271
Substrate
Meas. Tech.
Paraoxonase Activity Assay
pH
10.5±0
Temperature
298.15±0 K
Ki
13010000±0.0 nM
IC50
6230000±0.0 nM
Citation
 Ekinci, DBeydemir, S Effect of some analgesics on paraoxonase-1 purified from human serum. J Enzyme Inhib Med Chem 24:1034-9 (2009)  
Target
Name:
Serum paraoxonase/arylesterase 1
Synonyms:
A-esterase 1 K-45 PON 1 PON1_HUMAN Paraoxonase (hPON1) Serum aryldialkylphosphatase 1 | Serum paraoxonase 1 (PON1)
Type:
Enzyme
Mol. Mass.:
39719.73
Organism:
Homo sapiens (Human)
Description:
P27169
Residue:
355
  
Inhibitor
Name:
BDBM50022271
Synonyms:
2-(3-Benzoylphenyl)propionic acid 3-Benzoyl-alpha-methylbenzeneacetic acid CHEMBL571 KETOPROFEN Orudis (TN) | m-Benzoylhydratropic acid
Type:
Small organic molecule
Emp. Form.:
C16H14O3
Mol. Mass.:
254.2806
SMILES:
CC(C(O)=O)c1cccc(c1)C(=O)c1ccccc1
: