Target
Bifunctional purine biosynthesis protein ATIC
Ligand
BDBM92371
Substrate
Meas. Tech.
Enzyme Inhibition Assay
Temperature
298.15±0 K
Ki
8.7e+4± 9e+3 nM
Citation
 Spurr, IBBirts, CNCuda, FBenkovic, SJBlaydes, JPTavassoli, A Targeting Tumour Proliferation with a Small-Molecule Inhibitor of AICAR Transformylase Homodimerization. Chembiochem 13:1628-34 (2012)  
Target
Name:
Bifunctional purine biosynthesis protein ATIC
Synonyms:
5-aminoimidazole-4-carboxamide ribonucleotide formyltransferase AICAR Tfase ATIC Bifunctional purine biosynthesis protein PURH IMP cyclohydrolase Inosinicase PURH Thymidylate synthase/GAR transformylase/AICAR transformylase
Type:
Protein
Mol. Mass.:
64616.62
Organism:
Homo sapiens (Human)
Description:
P31939
Residue:
592
  
Inhibitor
Name:
BDBM92371
Synonyms:
RY Analogue, 11
Type:
Small organic molecule
Emp. Form.:
C20H32N6O4
Mol. Mass.:
420.5059
SMILES:
[#6]-[#6]-[#7]-[#6](=O)-[#6@H](-[#6]-c1ccc(-[#8]-[#6])cc1)-[#7]-[#6](=O)-[#6@H](-[#6]-[#6]-[#6]\[#7]=[#6](/[#7])-[#7])-[#7]-[#6](-[#6])=O
: