Target
Bifunctional purine biosynthesis protein ATIC
Ligand
BDBM92374
Substrate
Meas. Tech.
Enzyme Inhibition Assay
Temperature
298.15±0 K
Ki
685± 35 nM
Citation
 Spurr, IBBirts, CNCuda, FBenkovic, SJBlaydes, JPTavassoli, A Targeting Tumour Proliferation with a Small-Molecule Inhibitor of AICAR Transformylase Homodimerization. Chembiochem 13:1628-34 (2012)  
Target
Name:
Bifunctional purine biosynthesis protein ATIC
Synonyms:
5-aminoimidazole-4-carboxamide ribonucleotide formyltransferase AICAR Tfase ATIC Bifunctional purine biosynthesis protein PURH IMP cyclohydrolase Inosinicase PURH Thymidylate synthase/GAR transformylase/AICAR transformylase
Type:
Protein
Mol. Mass.:
64616.62
Organism:
Homo sapiens (Human)
Description:
P31939
Residue:
592
  
Inhibitor
Name:
BDBM92374
Synonyms:
RY Analogue, 14
Type:
Small organic molecule
Emp. Form.:
C19H29N7O5
Mol. Mass.:
435.4775
SMILES:
[#6]-[#6]-[#7]-[#6](=O)-[#6@H](-[#6]-c1ccc(cc1)N(=O)=O)-[#7]-[#6](=O)-[#6@H](-[#6]-[#6]-[#6]\[#7]=[#6](/[#7])-[#7])-[#7]-[#6](-[#6])=O
: