Target
3-phosphoinositide-dependent protein kinase 1
Ligand
BDBM26198
Substrate
Meas. Tech.
Proliferation Assay
EC50
1±0.0 nM
Citation
 Nagashima, KShumway, SDSathyanarayanan, SChen, AHDolinski, BXu, YKeilhack, HNguyen, TWiznerowicz, MLi, LLutterbach, BAChi, APaweletz, CAllison, TYan, YMunshi, SKKlippel, AKraus, MBobkova, EVDeshmukh, SXu, ZMueller, USzewczak, AAPan, BSRichon, VPollock, RBlume-Jensen, PNorthrup, AAndersen, JN Genetic and pharmacological inhibition of PDK1 in cancer cells: characterization of a selective allosteric kinase inhibitor. J Biol Chem 286:6433-48 (2011)  
Target
Name:
3-phosphoinositide-dependent protein kinase 1
Synonyms:
3-Phosphoinositide-Dependent Protein Kinase 1 (PDK1) 3-phosphoinositide-dependent protein kinase 1 3-phosphoinositide-dependent protein kinase 1 (PDK-1) Isoform 2 of 3-phosphoinositide-dependent protein kinase 1 PDPK1 Phosphoinositide-dependent protein kinase 1 (PDK1) hPDK1
Type:
Enzyme
Mol. Mass.:
63157.65
Organism:
Homo sapiens (Human)
Description:
O15530
Residue:
556
  
Inhibitor
Name:
BDBM26198
Synonyms:
4-tert-butyl-15-fluoro-3,5,10-triazatetracyclo[11.4.0.0^{2,6}.0^{7,12}]heptadeca-1(13),2(6),3,7(12),8,14,16-heptaen-11-one Compound # 2 PDK1 inhibitor, 1 | Tetracyclic Pyridone, 1
Type:
Small organic molecule
Emp. Form.:
C18H16FN3O
Mol. Mass.:
309.3375
SMILES:
CC(C)(C)c1nc2c([nH]1)c1ccc(F)cc1c1c2cc[nH]c1=O
: