Target
Alpha-(1,3)-fucosyltransferase 7
Ligand
BDBM50085536
Substrate
Meas. Tech.
SPA Assay
pH
7.3±0
Temperature
295.15±0 K
IC50
60±10 nM
Citation
 Niu, XFan, XSun, JTing, PNarula, SLundell, D Inhibition of fucosyltransferase VII by gallic acid and its derivatives. Arch Biochem Biophys 425:51-7 (2004)  
Target
Name:
Alpha-(1,3)-fucosyltransferase 7
Synonyms:
Alpha-(1,3)-fucosyltransferase VII FUT7_HUMAN Fuct VII
Type:
Mol. Mass.:
39259.56
Organism:
Homo sapiens (Human)
Description:
Q11130
Residue:
342
  
Inhibitor
Name:
BDBM50085536
Synonyms:
3,4,5-Trihydroxybenzoate, X CHEMBL288114 gallic acid
Type:
Small organic molecule
Emp. Form.:
C7H6O5
Mol. Mass.:
170.1195
SMILES:
OC(=O)c1cc(O)c(O)c(O)c1
: