Target
Matrilysin
Ligand
BDBM50070942
Substrate
Meas. Tech.
SPA Assay
pH
7.5±0
Temperature
295.15±0 K
IC50
8300±3700 nM
Citation
 Niu, XFan, XSun, JTing, PNarula, SLundell, D Inhibition of fucosyltransferase VII by gallic acid and its derivatives. Arch Biochem Biophys 425:51-7 (2004)  
Target
Name:
Matrilysin
Synonyms:
MMP7 MPSL1 Matrix metalloproteinase-7 (MMP-7) PUMP1
Type:
Enzyme
Mol. Mass.:
29681.54
Organism:
Homo sapiens (Human)
Description:
P09237
Residue:
267
  
Inhibitor
Name:
BDBM50070942
Synonyms:
(-)-Epigallocatechin gallate (-)-epigallocatechin 3-gallate CHEMBL297453 Epigallocatechin 3-gallate cid_65064
Type:
Small organic molecule
Emp. Form.:
C22H18O11
Mol. Mass.:
458.3717
SMILES:
Oc1cc(O)c2C[C@@H](OC(=O)c3cc(O)c(O)c(O)c3)[C@H](Oc2c1)c1cc(O)c(O)c(O)c1
: