Target
Macrophage metalloelastase
Ligand
BDBM92441
Substrate
Meas. Tech.
Enzyme Assay
pH
6.8±0
Temperature
298.15±0 K
Ki
0.19±0.0 nM
Citation
 Devel, LGarcia, SCzarny, BBeau, FLaJeunesse, EVera, LGeorgiadis, DStura, EDive, V Insights from selective non-phosphinic inhibitors of MMP-12 tailored to fit with an S1' loop canonical conformation. J Biol Chem 285:35900-9 (2010)  
Target
Name:
Macrophage metalloelastase
Synonyms:
HME MMP12_HUMAN Matrix metalloproteinase-12 (MMP 12) Matrix metalloproteinase-12 (MMP12) | Matrix metalloproteinases 12 (MMP-12)
Type:
Enzyme
Mol. Mass.:
54012.99
Organism:
Homo sapiens (Human)
Description:
P39900
Residue:
470
  
Inhibitor
Name:
BDBM92441
Synonyms:
RXP470, 1 | RXP470, Compound 4
Type:
Peptide
Emp. Form.:
C35H35BrClN4O10P
Mol. Mass.:
818.004
SMILES:
NC(=O)[C@@H](CCC(O)=O)NC(=O)[C@H](CCC(O)=O)NC(=O)C(Cc1cc(no1)-c1ccc(cc1)-c1cccc(Cl)c1)CP(O)(=O)c1ccc(Br)cc1
: