Target
Cytochrome P450 130
Ligand
BDBM92570
Substrate
Meas. Tech.
Binding Assay
Kd
3.26e+4± 6e+2 nM
Citation
 Podust, LMOuellet, Hvon Kries, JPde Montellano, PR Interaction of Mycobacterium tuberculosis CYP130 with heterocyclic arylamines. J Biol Chem 284:25211-9 (2009)  
Target
Name:
Cytochrome P450 130
Synonyms:
CP130_MYCTU Putative cytochrome P450 130 | cyp130
Type:
Enzyme
Mol. Mass.:
44574.98
Organism:
Mycobacterium tuberculosis
Description:
P9WPN5
Residue:
405
  
Inhibitor
Name:
BDBM92570
Synonyms:
Arylamine compound 4
Type:
Small organic molecule
Emp. Form.:
C14H13N3
Mol. Mass.:
223.2731
SMILES:
Cc1cccc(c1)-n1cnc2cc(N)ccc12
: