Target
Protein kinase C delta type
Ligand
BDBM50107112
Substrate
Meas. Tech.
Binding Assay
pH
7.4±0
Temperature
291.15±0 K
Ki
1.16±0.07 nM
Citation
 Choi, SHCzifra, GKedei, NLewin, NELazar, JPu, YMarquez, VEBlumberg, PM Characterization of the interaction of phorbol esters with the C1 domain of MRCK (myotonic dystrophy kinase-related Cdc42 binding kinase) alpha/beta. J Biol Chem 283:10543-9 (2008)  
Target
Name:
Protein kinase C delta type
Synonyms:
KPCD_HUMAN PKCD Protein Kinase C- delta nPKC-delta
Type:
Enzyme
Mol. Mass.:
77516.79
Organism:
Homo sapiens (Human)
Description:
The recombinant human PKC enzymes were produced using a baculovirus expression system in SF9 cells
Residue:
676
  
Inhibitor
Name:
BDBM50107112
Synonyms:
(Z) 2,2-Dimethyl-propionic acid 2-hydroxymethyl-4-(3-isobutyl-5-methyl-hexylidene)-5-oxo-tetrahydro-furan-2-ylmethyl ester (Z)-2-(2-(hydroxymethyl)-4-(3-isobutyl-5-methylhexylidene)-5-oxo-tetrahydrofuran-2-yl)ethyl pivalate 2,2-Dimethyl-propionic acid 2-hydroxymethyl-4-[3-isobutyl-5-methyl-hex-(Z)-ylidene]-5-oxo-tetrahydro-furan-2-ylmethyl ester DAG-lactone (HK-434)
Type:
Small organic molecule
Emp. Form.:
C22H38O5
Mol. Mass.:
382.5341
SMILES:
CC(C)CC(C\C=C1\CC(CO)(COC(=O)C(C)(C)C)OC1=O)CC(C)C
: