Target
Histone-lysine N-methyltransferase, H3 lysine-79 specific
Ligand
BDBM92642
Substrate
Meas. Tech.
Enzyme Assay
Ki
320±0.0 nM
Kd
71±40 nM
Citation
 Basavapathruni, AJin, LDaigle, SRMajer, CRTherkelsen, CAWigle, TJKuntz, KWChesworth, RPollock, RMScott, MPMoyer, MPRichon, VMCopeland, RAOlhava, EJ Conformational Adaptation Drives Potent, Selective and Durable Inhibition of the Human Protein Methyltransferase DOT1L. Chem Biol Drug Des 80:971-80 (2012)  
Target
Name:
Histone-lysine N-methyltransferase, H3 lysine-79 specific
Synonyms:
2.1.1.43 DOT1-like protein (Dot1L) DOT1L_HUMAN Histone H3-K79 methyltransferase Histone Methyltransferase DOT1L KIAA1814 Lysine N-methyltransferase 4
Type:
Protein
Mol. Mass.:
184911.91
Organism:
Homo sapiens (Human)
Description:
Q8TEK3
Residue:
1537
  
Inhibitor
Name:
BDBM92642
Synonyms:
SAH
Type:
Organic molecule
Emp. Form.:
C14H20N6O5S
Mol. Mass.:
384.411
SMILES:
NC(CCSCC1OC([C@H](O)[C@@H]1O)n1cnc2c(N)ncnc12)C(O)=O
: