Target
Casein kinase I isoform alpha
Ligand
BDBM50011236
Substrate
Meas. Tech.
Enzyme Assay
pH
7.4±0
Temperature
303.15±0 K
IC50
1.10e+5±n/a nM
Citation
 Chijiwa, THagiwara, MHidaka, H A newly synthesized selective casein kinase I inhibitor, N-(2-aminoethyl)-5-chloroisoquinoline-8-sulfonamide, and affinity purification of casein kinase I from bovine testis. J Biol Chem 264:4924-7 (1989) Target
Name:
Casein kinase I isoform alpha
Synonyms:
CK1 CSNK1A1 Casein kinase 1 alpha (CK1 alpha) KC1A_HUMAN
Type:
Serine/threonine-protein kinase
Mol. Mass.:
38936.59
Organism:
Homo sapiens (Human)
Description:
P48729
Residue:
337
  
Inhibitor
Name:
BDBM50011236
Synonyms:
CHEMBL344314 Isoquinolinesulfonamide, H-9 | N-(2-aminoethyl)isoquinoline-5-sulfonamide
Type:
Small organic molecule
Emp. Form.:
C11H13N3O2S
Mol. Mass.:
251.305
SMILES:
NCCNS(=O)(=O)c1cccc2cnccc12
: