Target
Protein kinase C alpha type
Ligand
BDBM50011236
Substrate
Meas. Tech.
Enzyme Assay
pH
7.4±0
Temperature
303.15±0 K
IC50
1.8e+4±n/a nM
Citation
 Chijiwa, THagiwara, MHidaka, H A newly synthesized selective casein kinase I inhibitor, N-(2-aminoethyl)-5-chloroisoquinoline-8-sulfonamide, and affinity purification of casein kinase I from bovine testis. J Biol Chem 264:4924-7 (1989) Target
Name:
Protein kinase C alpha type
Synonyms:
KPCA_HUMAN PKC alpha and beta-2 PKC-alpha PRKACA Protein Kinase C- alpha Protein kinase C alpha (PKCa) Protein kinase C alpha type (PRKCA) RAF proto-oncogene serine/threonine-protein kinase
Type:
Enzyme
Mol. Mass.:
76755.65
Organism:
Homo sapiens (Human)
Description:
The recombinant human PKC enzymes were produced using a baculovirus expression system in SF9 cells
Residue:
672
  
Inhibitor
Name:
BDBM50011236
Synonyms:
CHEMBL344314 Isoquinolinesulfonamide, H-9 | N-(2-aminoethyl)isoquinoline-5-sulfonamide
Type:
Small organic molecule
Emp. Form.:
C11H13N3O2S
Mol. Mass.:
251.305
SMILES:
NCCNS(=O)(=O)c1cccc2cnccc12
: