Target
Cholinesterase
Ligand
BDBM120262
Substrate
Meas. Tech.
Inhibition Assay
Ki
1.98e+5± 1e+3 nM
Citation
 Macdonald, IRMartin, ERosenberry, TLDarvesh, S Probing the peripheral site of human butyrylcholinesterase. Biochemistry 51:7046-53 (2012)  
Target
Name:
Cholinesterase
Synonyms:
Acylcholine acylhydrolase Butyrylcholine esterase (BChE) Butyrylcholinesterase (BuChE) CHLE_HUMAN Cholinesterases Pseudocholinesterase
Type:
Homotetramer
Mol. Mass.:
68422.27
Organism:
Homo sapiens (Human)
Description:
P06276
Residue:
602
  
Inhibitor
Name:
BDBM120262
Synonyms:
EDROPHONIUM BROMIDE Edrophonium cid_8307
Type:
Small organic molecule
Emp. Form.:
C10H16NO
Mol. Mass.:
166.2396
SMILES:
CC[N+](C)(C)c1cccc(O)c1
: