Target
DNA-(apurinic or apyrimidinic site) endonuclease
Ligand
BDBM92731
Substrate
Meas. Tech.
Gel-Based Assay
IC50
2.9e+3±n/a nM
Citation
 Srinivasan, AWang, LCline, CJXie, ZSobol, RWXie, XQGold, B Identification and characterization of human apurinic/apyrimidinic endonuclease-1 inhibitors. Biochemistry 51:6246-59 (2012)  
Target
Name:
DNA-(apurinic or apyrimidinic site) endonuclease
Synonyms:
APE APEX APEX1_HUMAN Apurinic-apyrimidinic endonuclease 1 (APE-1) DNA-(apurinic or apyrimidinic site) lyase REF1
Type:
Protein
Mol. Mass.:
35560.12
Organism:
Homo sapiens (Human)
Description:
P27695
Residue:
318
  
Inhibitor
Name:
BDBM92731
Synonyms:
NSC332389, 3
Type:
Small molecule
Emp. Form.:
C19H15N3O4
Mol. Mass.:
349.3401
SMILES:
Cc1cc(N=NCc2ccc3OCOc3c2)c2cc3OCOc3cc2n1
: