Target
25-hydroxyvitamin D-1 alpha hydroxylase, mitochondrial
Ligand
BDBM92781
Substrate
Meas. Tech.
CYP27B1 Inhibition Assay
Ki
3.34e+3± 3.8e+2 nM
Citation
 Zhu, JBarycki, RChiellini, GDeluca, HF Screening of selective inhibitors of 1a,25-dihydroxyvitamin D3 24-hydroxylase using recombinant human enzyme expressed in Escherichia coli. Biochemistry 49:10403-11 (2010)  
Target
Name:
25-hydroxyvitamin D-1 alpha hydroxylase, mitochondrial
Synonyms:
25-hydroxyvitamin D-1 alpha hydroxylase, mitochondrial CYP1ALPHA CYP27B1 | Cytochrome P450 27B1
Type:
Protein
Mol. Mass.:
56522.50
Organism:
Homo sapiens (Human)
Description:
O15528
Residue:
508
  
Inhibitor
Name:
BDBM92781
Synonyms:
CPA1
Type:
Small molecule
Emp. Form.:
C27H43NO2
Mol. Mass.:
413.6358
SMILES:
C[C@@H](CCCNC1CC1)C1CCC2\C(CCC[C@]12C)=C\C=C1\C[C@H](O)C(=C)[C@H](O)C1
: