Target
Nociceptin receptor
Ligand
BDBM86547
Substrate
Ki
1000±n/a nM
Comments
PDSP_1935
Citation
 Mogil, JSPasternak, GW The molecular and behavioral pharmacology of the orphanin FQ/nociceptin peptide and receptor family. Pharmacol Rev 53:381-415 (2001) Target
Name:
Nociceptin receptor
Synonyms:
K3 opiate receptor Kappa-type 3 opioid receptor Nociceptin/Orphanin FQ, NOP receptor ORGC Oprl Orphanin FQ receptor
Type:
Enzyme Catalytic Domain
Mol. Mass.:
40499.09
Organism:
MOUSE
Description:
Nociceptin/Orphanin FQ, NOP receptor 0 MOUSE::P35377
Residue:
367
  
Inhibitor
Name:
BDBM86547
Synonyms:
CAS_135349 U50,488H
Type:
Small organic molecule
Emp. Form.:
C19H26Cl2N2O
Mol. Mass.:
369.329
SMILES:
CN(C1CCCCC1N1CCCC1)C(=O)Cc1ccc(Cl)c(Cl)c1
: