Target
AP2-associated protein kinase 1
Ligand
BDBM279456
Substrate
Meas. Tech.
AAK1 Kinase Assay
pH
7.4±n/a
Temperature
298.15±n/a K
IC50
10.00±n/a nM
Comments
extracted
Citation
 Dzierba, CDBronson, JJMacor, JEDasgupta, BNara, SJVrudhula, VMPan, SHartz, RARajamani, R Heterocyclic kinase inhibitors US Patent  US10035777 Publication Date 7/31/2018 
Target
Name:
AP2-associated protein kinase 1
Synonyms:
AAK1 Adaptor-associated kinase 1 | KIAA1048
Type:
PROTEIN
Mol. Mass.:
103884.23
Organism:
Homo sapiens (Human)
Description:
ChEMBL_774569
Residue:
961
  
Inhibitor
Name:
BDBM279456
Synonyms:
(R)-1-(5-(1H-pyrazolo[3, 4-b]pyridin-4-yl)-1H-benzo[d]imidazol-2-yl)-3-methylbutan-1-amine | US10035777, Example 7
Type:
Small organic molecule
Emp. Form.:
C17H26BrN3O3
Mol. Mass.:
400.311
SMILES:
CC(C)C[C@@H](NC(=O)OC(C)(C)C)C(=O)Nc1cc(Br)ccc1N
: