Target
AP2-associated protein kinase 1
Ligand
BDBM279485
Substrate
Meas. Tech.
AAK1 Kinase Assay
pH
7.4±n/a
Temperature
298.15±n/a K
IC50
25.0±n/a nM
Comments
extracted
Citation
 Dzierba, CDBronson, JJMacor, JEDasgupta, BNara, SJVrudhula, VMPan, SHartz, RARajamani, R Heterocyclic kinase inhibitors US Patent  US10035777 Publication Date 7/31/2018 
Target
Name:
AP2-associated protein kinase 1
Synonyms:
AAK1 Adaptor-associated kinase 1 | KIAA1048
Type:
PROTEIN
Mol. Mass.:
103884.23
Organism:
Homo sapiens (Human)
Description:
ChEMBL_774569
Residue:
961
  
Inhibitor
Name:
BDBM279485
Synonyms:
(R)-1-(6-(3-methoxypyridin-4-yl)-1-(2,2,2-trifluoroethyl)-1H-benzo[d]imidazol-2-yl)-3-methylbutan-1-amine | US10035777, Example 35
Type:
Small organic molecule
Emp. Form.:
C20H23F3N4O
Mol. Mass.:
392.418
SMILES:
COc1cnccc1-c1ccc2nc([C@H](N)CC(C)C)n(CC(F)(F)F)c2c1
: