Target
AP2-associated protein kinase 1
Ligand
BDBM279513
Substrate
Meas. Tech.
AAK1 Kinase Assay
pH
7.4±n/a
Temperature
298.15±n/a K
IC50
14.0±n/a nM
Comments
extracted
Citation
 Dzierba, CDBronson, JJMacor, JEDasgupta, BNara, SJVrudhula, VMPan, SHartz, RARajamani, R Heterocyclic kinase inhibitors US Patent  US10035777 Publication Date 7/31/2018 
Target
Name:
AP2-associated protein kinase 1
Synonyms:
AAK1 Adaptor-associated kinase 1 | KIAA1048
Type:
PROTEIN
Mol. Mass.:
103884.23
Organism:
Homo sapiens (Human)
Description:
ChEMBL_774569
Residue:
961
  
Inhibitor
Name:
BDBM279513
Synonyms:
(R)-N-(4-(2-(3-methyl-1-(methylamino)butyl)-1H-benzo[d]imidazol-5-yl)pyridin-2-yl)acetamide | US10035777, Example 63
Type:
Small organic molecule
Emp. Form.:
C25H33N5O3
Mol. Mass.:
451.5612
SMILES:
CC(C)C[C@@H](N(C)C(=O)OC(C)(C)C)c1nc2cc(ccc2[nH]1)-c1ccnc(NC(C)=O)c1
: