Target
AP2-associated protein kinase 1
Ligand
BDBM279516
Substrate
Meas. Tech.
AAK1 Kinase Assay
pH
7.4±n/a
Temperature
298.15±n/a K
IC50
45.0±n/a nM
Comments
extracted
Citation
 Dzierba, CDBronson, JJMacor, JEDasgupta, BNara, SJVrudhula, VMPan, SHartz, RARajamani, R Heterocyclic kinase inhibitors US Patent  US10035777 Publication Date 7/31/2018 
Target
Name:
AP2-associated protein kinase 1
Synonyms:
AAK1 Adaptor-associated kinase 1 | KIAA1048
Type:
PROTEIN
Mol. Mass.:
103884.23
Organism:
Homo sapiens (Human)
Description:
ChEMBL_774569
Residue:
961
  
Inhibitor
Name:
BDBM279516
Synonyms:
3-methyl-1-(5-(pyridin-4-yl)-1H-benzo[d]imidazol-2-yl)-N-(2,2,2-trifluoroethyl)butan-1-amine | US10035777, Example 66
Type:
Small organic molecule
Emp. Form.:
C19H21F3N4
Mol. Mass.:
362.392
SMILES:
CC(C)C[C@@H](NCC(F)(F)F)c1nc2cc(ccc2[nH]1)-c1ccncc1
: