Target
Integrin alpha-V/beta-5
Ligand
BDBM279562
Substrate
Meas. Tech.
Solid Phase Receptor Assay (SPRA) for alphaVbeta5
pH
7.4±n/a
Temperature
298.15±n/a K
IC50
0.200±n/a nM
Comments
extracted
Citation
 Ruminski, PGGriggs, DW Meta-azacyclic amino benzoic acid derivatives as pan integrin antagonists US Patent  US10035778 Publication Date 7/31/2018 
Target
Name:
Integrin alpha-V/beta-5
Synonyms:
ITGAV/ITGB5 | Integrin beta-5/Vitronectin receptor alpha
Type:
Enzyme
Mol. Mass.:
Description:
Components:
This complex has 2 components.
Component 1
Name:
Integrin alpha-V
Synonyms:
ITAV_HUMAN Integrin alpha-V/alpha-5 VNRA Vitronectin receptor | Vitronectin receptor subunit alpha
Type:
PROTEIN
Mol. Mass.:
116024.92
Organism:
Homo sapiens (Human)
Description:
ChEMBL_582336
Residue:
1048
  
Component 2
Name:
Integrin beta-5
Synonyms:
ITB5_HUMAN | ITGB5
Type:
PROTEIN
Mol. Mass.:
88047.37
Organism:
Homo sapiens (Human)
Description:
EBI_10915
Residue:
799
  
Inhibitor
Name:
BDBM279562
Synonyms:
(3S)-3-[3-chloro-5-(difluoromethyl)phenyl)-3-(2-(3-hydroxy-5-((5-hydroxy-1,4,5,6-tetrahydropyrimidin-2-yl)amino)benzamido)acetamido]propanoic acid US10577330, Example 3
Type:
Small organic molecule
Emp. Form.:
C23H24ClF2N5O6
Mol. Mass.:
539.916
SMILES:
OC1CNC(Nc2cc(O)cc(c2)C(=O)NCC(=O)N[C@@H](CC(O)=O)c2cc(Cl)cc(c2)C(F)F)=NC1
: