Target
Bifunctional aspartokinase/homoserine dehydrogenase 1
Ligand
BDBM92985
Substrate
Meas. Tech.
Inhibition Assay
Ki
5000000±1000000 nM
Citation
 Angeles, TSHunsley, JRViola, RE Reversal of enzyme regiospecificity with alternative substrates for aspartokinase I from Escherichia coli. Biochemistry 31:799-805 (1992)  
Target
Name:
Bifunctional aspartokinase/homoserine dehydrogenase 1
Synonyms:
AK1H_ECOLI Bifunctional aspartokinase/homoserine dehydrogenase 1 thrA1 | thrA2
Type:
Protein
Mol. Mass.:
89109.15
Organism:
Escherichia coli
Description:
P00561
Residue:
820
  
Inhibitor
Name:
BDBM92985
Synonyms:
2-Aminobutyrate
Type:
Small molecule
Emp. Form.:
C4H9NO2
Mol. Mass.:
103.1198
SMILES:
CCC([NH3+])C([O-])=O
: