Target
Bifunctional aspartokinase/homoserine dehydrogenase 1
Ligand
BDBM92994
Substrate
Meas. Tech.
Inhibition Assay
Ki
32000000±4000000 nM
Citation
 Angeles, TSHunsley, JRViola, RE Reversal of enzyme regiospecificity with alternative substrates for aspartokinase I from Escherichia coli. Biochemistry 31:799-805 (1992)  
Target
Name:
Bifunctional aspartokinase/homoserine dehydrogenase 1
Synonyms:
AK1H_ECOLI Bifunctional aspartokinase/homoserine dehydrogenase 1 thrA1 | thrA2
Type:
Protein
Mol. Mass.:
89109.15
Organism:
Escherichia coli
Description:
P00561
Residue:
820
  
Inhibitor
Name:
BDBM92994
Synonyms:
L-Valine
Type:
Small molecule
Emp. Form.:
C5H10NO2
Mol. Mass.:
116.1389
SMILES:
CC(C)[C@H](N)C([O-])=O
: