Target
Bifunctional aspartokinase/homoserine dehydrogenase 1
Ligand
BDBM92998
Substrate
Meas. Tech.
Inhibition Assay
Ki
99000000±20000000 nM
Citation
 Angeles, TSHunsley, JRViola, RE Reversal of enzyme regiospecificity with alternative substrates for aspartokinase I from Escherichia coli. Biochemistry 31:799-805 (1992)  
Target
Name:
Bifunctional aspartokinase/homoserine dehydrogenase 1
Synonyms:
AK1H_ECOLI Bifunctional aspartokinase/homoserine dehydrogenase 1 thrA1 | thrA2
Type:
Protein
Mol. Mass.:
89109.15
Organism:
Escherichia coli
Description:
P00561
Residue:
820
  
Inhibitor
Name:
BDBM92998
Synonyms:
L-alanine
Type:
Small molecule
Emp. Form.:
C3H6NO2
Mol. Mass.:
88.0858
SMILES:
C[C@H](N)C([O-])=O
: