Target
Purine nucleoside phosphorylase
Ligand
BDBM93006
Substrate
Meas. Tech.
Competitive Inhibition Assay
Ki
5.76e+5±n/a nM
Citation
 Dempcy, ROSkibo, EB Rational design of quinazoline-based irreversible inhibitors of human erythrocyte purine nucleoside phosphorylase. Biochemistry 30:8480-7 (1991)  
Target
Name:
Purine nucleoside phosphorylase
Synonyms:
Inosine phosphorylase NP PNPH_HUMAN | Purine nucleoside phosphorylase (PNPase)
Type:
Enzyme
Mol. Mass.:
32119.53
Organism:
Homo sapiens (Human)
Description:
Residue:
289
  
Inhibitor
Name:
BDBM93006
Synonyms:
Substituted Quinazolin-4(3H)-one, 13
Type:
Small molecule
Emp. Form.:
C8H6N2O2
Mol. Mass.:
162.1454
SMILES:
Oc1cccc2nc[nH]c(=O)c12
: