Target
Carbamoyl-phosphate synthase small chain
Ligand
BDBM93009
Substrate
Meas. Tech.
Enzyme Assay
pH
7.5±0
Ki
5.4e+4±n/a nM
Citation
 Miran, SGChang, SHRaushel, FM Role of the four conserved histidine residues in the amidotransferase domain of carbamoyl phosphate synthetase. Biochemistry 30:7901-7 (1991)  
Target
Name:
Carbamoyl-phosphate synthase small chain
Synonyms:
CARA_ECOLI Carbamoyl-phosphate synthetase pyrA
Type:
Protein
Mol. Mass.:
41429.00
Organism:
Escherichia coli (strain K12)
Description:
P0A6F1
Residue:
382
  
Inhibitor
Name:
BDBM93009
Synonyms:
Glutamine Analogue, 1
Type:
Small molecule
Emp. Form.:
C5H10N2O3
Mol. Mass.:
146.1445
SMILES:
NC(=O)CCC([NH3+])C([O-])=O
: