Target
Complement C1s subcomponent
Ligand
BDBM93094
Substrate
Meas. Tech.
Enzymatic Assay
pH
8.05±0
Temperature
298.65±0 K
Ki
76500±0.0 nM
Citation
 Bing, DH Nature of the active site of a subunit of the first component of human complement. Biochemistry 8:4503-10 (1969)  
Target
Name:
Complement C1s subcomponent
Synonyms:
C1 esterase C1S_HUMAN Complement C1s subcomponent Complement C1s subcomponent light chain Trypsin | complement component 1, s subcomponent
Type:
Protein
Mol. Mass.:
76657.91
Organism:
Homo sapiens (Human)
Description:
P09871
Residue:
688
  
Inhibitor
Name:
BDBM93094
Synonyms:
2-Guanidino-4-methylguinazoline
Type:
Small molecule
Emp. Form.:
C10H11N5
Mol. Mass.:
201.2278
SMILES:
Cc1nc(NC(N)=N)nc2ccccc12
: