Target
Beta-1 adrenergic receptor
Ligand
BDBM25761
Substrate
Meas. Tech.
Binding Assay
Ki
3±0 nM
Citation
 Kossakowski, JBielenica, AStruga, MKoziol, A Synthesis and pharmacological evaluation of 4-[2- hydroxy-3-(4-phenyl-piperazin-1-yl)-propoxy]-4- azatricyclo[5.2.1.02,6]dec-8-ene-3,5-dione Medicinal Chemistry Research 17:507-514 (2008)    Article 
Target
Name:
Beta-1 adrenergic receptor
Synonyms:
ADRB1R, B1AR Adrb1 Adrenergic receptor beta Beta-1 adrenoreceptor adrenergic Beta1,2
Type:
Protein
Mol. Mass.:
50486.84
Organism:
Rattus norvegicus (Rat)
Description:
P18090
Residue:
466
  
Inhibitor
Name:
BDBM25761
Synonyms:
Anapriline CHEMBL27 PROPRANOLOL, d PROPRANOLOL,(+) Propanolol Propranolol | [2-hydroxy-3-(naphthalen-1-yloxy)propyl](propan-2-yl)amine
Type:
Small organic molecule
Emp. Form.:
C16H21NO2
Mol. Mass.:
259.3434
SMILES:
CC(C)NCC(O)COc1cccc2ccccc12
: