Target
Sigma non-opioid intracellular receptor 1
Ligand
BDBM93152
Substrate
Meas. Tech.
Binding Assay
Ki
2.3±0.0 nM
Citation
 Yous, SWallez, VBelloir, MCaignard, DHMcCurdy, CRPoupaert, JH Novel 2(3H)-benzothiazolones as highly potent and selective sigma-1 receptor ligands Medicinal Chemistry Research 14:158-168 (2005)    Article 
Target
Name:
Sigma non-opioid intracellular receptor 1
Synonyms:
OPRS1 SIGMAR1 Sigma non-opioid intracellular receptor 1 Sigma1-receptor Sterol isomerase-like protein
Type:
Protein
Mol. Mass.:
25307.17
Organism:
Cavia porcellus (Guinea pig)
Description:
Q60492
Residue:
223
  
Inhibitor
Name:
BDBM93152
Synonyms:
3-(1-piperidinopropyl)-6-propanoylbenzothiazolin-2-one, 5
Type:
Small molecule
Emp. Form.:
C18H24N2O2S
Mol. Mass.:
332.46
SMILES:
CCC(=O)c1ccc2n(CCCN3CCCCC3)c(=O)sc2c1
: