Target
Hexokinase-4
Ligand
BDBM93225
Substrate
Meas. Tech.
Kinase Assay
IC50
4e+3±n/a nM
Citation
 Urich, RWishart, GKiczun, MRichters, ATidten-Luksch, NRauh, DSherborne, BWyatt, PGBrenk, R De novo design of protein kinase inhibitors by in silico identification of hinge region-binding fragments. ACS Chem Biol 8:1044-52 (2013)  
Target
Name:
Hexokinase-4
Synonyms:
GCK Glucokinase (GK) HK IV HXK4_HUMAN Hexokinase-D
Type:
Enzyme
Mol. Mass.:
52175.81
Organism:
Homo sapiens (Human)
Description:
P35557
Residue:
465
  
Inhibitor
Name:
BDBM93225
Synonyms:
Kinase inhibitor, A2
Type:
Small molecule
Emp. Form.:
C14H9F2N3O
Mol. Mass.:
273.2376
SMILES:
Nc1cnc2c(cccn2c1=O)-c1c(F)cccc1F
: