Target
Protein Wnt-3a
Ligand
BDBM89462
Substrate
IC50
>50000±n/a nM
Citation
 PubChem, PC Dose response validation of uHTS Gli-SUFU antagonist hits in a Wnt3a luminescent reporter assay PubChem Bioassay (2012)[AID] 
Target
Name:
Protein Wnt-3a
Synonyms:
WNT3A_MOUSE Wnt3a | protein Wnt-3a precursor
Type:
PROTEIN
Mol. Mass.:
39269.29
Organism:
Mus musculus
Description:
ChEMBL_813156
Residue:
352
  
Inhibitor
Name:
BDBM89462
Synonyms:
3-methoxy-4-[[5-methyl-6-oxidanylidene-9-(2-phenylethyl)-7,8-dihydropyrimido[4,5-b][1,4]diazepin-2-yl]amino]-N-(1-methylpiperidin-4-yl)benzamide 3-methoxy-4-[[5-methyl-6-oxo-9-(2-phenylethyl)-7,8-dihydropyrimido[4,5-b][1,4]diazepin-2-yl]amino]-N-(1-methylpiperidin-4-yl)benzamide MLS002232307 cid_42628533
Type:
Small organic molecule
Emp. Form.:
C30H37N7O3
Mol. Mass.:
543.6599
SMILES:
COc1cc(ccc1Nc1ncc2N(C)C(=O)CCN(CCc3ccccc3)c2n1)C(=O)NC1CCN(C)CC1
: