Target
Perilipin-1
Ligand
BDBM64773
Substrate
IC50
2312±n/a nM
Citation
 PubChem, PC Counterscreen for inhibitors of the interaction of the lipase co-activator protein, abhydrolase domain containing 5 (ABHD5) with perilipin-5 (MLDP; PLIN5) PubChem Bioassay (2012)[AID] 
Target
Name:
Perilipin-1
Synonyms:
PERI PLIN1 | PLIN1_HUMAN
Type:
Enzyme Catalytic Domain
Mol. Mass.:
55988.69
Organism:
Homo sapiens (Human)
Description:
gi_223718203
Residue:
522
  
Inhibitor
Name:
BDBM64773
Synonyms:
(1E)-2-[6-[[amino-[(E)-[amino-(4-chloroanilino)methylene]amino]methylene]amino]hexyl]-1-[amino-(4-chloroanilino)methylene]guanidine (1E)-2-[6-[[azanyl-[(E)-[azanyl-[(4-chlorophenyl)amino]methylidene]amino]methylidene]amino]hexyl]-1-[azanyl-[(4-chlorophenyl)amino]methylidene]guanidine Chlorhexidine SMR000857146 | cid_9552079
Type:
Small organic molecule
Emp. Form.:
C22H30Cl2N10
Mol. Mass.:
505.447
SMILES:
NC(Nc1ccc(Cl)cc1)=NC(N)=NCCCCCCN=C(N)N=C(N)Nc1ccc(Cl)cc1
: