Target
Perilipin-5
Ligand
BDBM94558
Substrate
IC50
1686±n/a nM
Citation
 PubChem, PC Luminescence-based biochemical high throughput dose response assay for inhibitors of the interaction of the lipase co-activator protein, abhydrolase domain containing 5 (ABHD5) with perilipin-5 (MLDP; PLIN5) PubChem Bioassay (2012)[AID] 
Target
Name:
Perilipin-5
Synonyms:
LSDP5 PAT-1 PLIN5_HUMAN
Type:
Enzyme Catalytic Domain
Mol. Mass.:
50774.20
Organism:
Homo sapiens (Human)
Description:
gi_116292172
Residue:
463
  
Inhibitor
Name:
BDBM94558
Synonyms:
MLS003674213 N-tert-butyl-2-[3-(2-furyl)-2-keto-quinoxalin-1-yl]-2-(4-methoxyphenyl)acetamide N-tert-butyl-2-[3-(furan-2-yl)-2-oxoquinoxalin-1-yl]-2-(4-methoxyphenyl)acetamide cid_53383338
Type:
Small organic molecule
Emp. Form.:
C25H25N3O4
Mol. Mass.:
431.4837
SMILES:
COc1ccc(cc1)C(C(=O)NC(C)(C)C)n1c2ccccc2nc(-c2ccco2)c1=O
: