Target
Perilipin-5
Ligand
BDBM43818
Substrate
IC50
1026±n/a nM
Citation
 PubChem, PC Luminescence-based biochemical high throughput dose response assay for inhibitors of the interaction of the lipase co-activator protein, abhydrolase domain containing 5 (ABHD5) with perilipin-5 (MLDP; PLIN5) PubChem Bioassay (2012)[AID] 
Target
Name:
Perilipin-5
Synonyms:
LSDP5 PAT-1 PLIN5_HUMAN
Type:
Enzyme Catalytic Domain
Mol. Mass.:
50774.20
Organism:
Homo sapiens (Human)
Description:
gi_116292172
Residue:
463
  
Inhibitor
Name:
BDBM43818
Synonyms:
(2Z)-3-ethyl-2-[(E)-3-(3-ethyl-5-phenyl-1,3-benzoxazol-3-ium-2-yl)prop-2-enylidene]-5-phenyl-1,3-benzoxazole;ethyl sulfate cid_10864994
Type:
Small organic molecule
Emp. Form.:
C33H29N2O2
Mol. Mass.:
485.595
SMILES:
CCN1\C(Oc2ccc(cc12)-c1ccccc1)=C\C=C\c1oc2ccc(cc2[n+]1CC)-c1ccccc1
: