Target
Perilipin-5
Ligand
BDBM33139
Substrate
IC50
4053±n/a nM
Citation
 PubChem, PC Luminescence-based biochemical high throughput dose response assay for inhibitors of the interaction of the lipase co-activator protein, abhydrolase domain containing 5 (ABHD5) with perilipin-5 (MLDP; PLIN5) PubChem Bioassay (2012)[AID] 
Target
Name:
Perilipin-5
Synonyms:
LSDP5 PAT-1 PLIN5_HUMAN
Type:
Enzyme Catalytic Domain
Mol. Mass.:
50774.20
Organism:
Homo sapiens (Human)
Description:
gi_116292172
Residue:
463
  
Inhibitor
Name:
BDBM33139
Synonyms:
3-[(E)-3-(2,5-dimethylphenyl)-1-oxoprop-2-enyl]-2-hydroxy-1-cyclohepta-2,4,6-trienone 3-[(E)-3-(2,5-dimethylphenyl)prop-2-enoyl]-2-hydroxycyclohepta-2,4,6-trien-1-one 3-[3-(2,5-dimethylphenyl)acryloyl]-2-hydroxy-2,4,6-cycloheptatrien-1-one SMR000229843 | cid_7314608
Type:
Small organic molecule
Emp. Form.:
C18H16O3
Mol. Mass.:
280.3178
SMILES:
Cc1ccc(C)c(\C=C\C(=O)c2ccccc(=O)c2O)c1
: