Target
Epidermal growth factor receptor
Ligand
BDBM4030
Substrate
poly(E, A, Y)
Meas. Tech.
Kinase Inhibition Assay
IC50
5000±n/a nM
Citation
 Rewcastle, GWPalmer, BDDobrusin, EMFry, DWKraker, AJDenny, WA Tyrosine kinase inhibitors. 3. Structure-activity relationships for inhibition of protein tyrosine kinases by nuclear-substituted derivatives of 2,2'-dithiobis(1-methyl-N-phenyl-1H-indole-3-carboxamide). J Med Chem 37:2033-42 (1994)  
Target
Name:
Epidermal growth factor receptor
Synonyms:
EGF Receptor Substrate EGFR_HUMAN ERBB1 Epidermal Growth Factor Receptor erbB-1 Epidermal growth factor receptor (EGFR) HER1 Proto-oncogene c-ErbB-1 Tyrosine-Protein Kinase ErbB-1
Type:
Receptor Kinase Domain
Mol. Mass.:
134279.59
Organism:
Homo sapiens (Human)
Description:
P00533
Residue:
1210
  
Inhibitor
Name:
BDBM4030
Synonyms:
1-methyl-2-{[1-methyl-5-nitro-3-(phenylcarbamoyl)-1H-indol-2-yl]disulfanyl}-5-nitro-N-phenyl-1H-indole-3-carboxamide | dithiobis(1H-indole-3-carboxamide) deriv. 10o
Type:
Small organic molecule
Emp. Form.:
C32H24N6O6S2
Mol. Mass.:
652.7
SMILES:
Cn1c(SSc2c(C(=O)Nc3ccccc3)c3cc(ccc3n2C)[N+]([O-])=O)c(C(=O)Nc2ccccc2)c2cc(ccc12)[N+]([O-])=O
:
Substrate
Name:
poly(E, A, Y)
Synonyms:
Type:
Random Polymer
Mol. Mass.:
358.43
Organism:
Description:
A 6:3:1 random copolymer of glutamate, alanine and tyrosine. 5 uM ATP containing 0.2 uCi of 0.5-3 Ci/mmol 32P labeled ATP.
Residue:
3
NA