Target
Tyrosine-protein kinase transforming protein Src
Ligand
BDBM4048
Substrate
poly(E,Y)
Meas. Tech.
Kinase Inhibition Assay
IC50
>100000±n/a nM
Citation
 Rewcastle, GWPalmer, BDDobrusin, EMFry, DWKraker, AJDenny, WA Tyrosine kinase inhibitors. 3. Structure-activity relationships for inhibition of protein tyrosine kinases by nuclear-substituted derivatives of 2,2'-dithiobis(1-methyl-N-phenyl-1H-indole-3-carboxamide). J Med Chem 37:2033-42 (1994)  
Target
Name:
Tyrosine-protein kinase transforming protein Src
Synonyms:
P60-Src V-SRC | pp60v-src
Type:
Enzyme
Mol. Mass.:
58884.32
Organism:
Avian sarcoma virus
Description:
P00525
Residue:
526
  
Inhibitor
Name:
BDBM4048
Synonyms:
2-(Benzyldithio)-1-methyl-N-phenyl-1H-indole-3-carboxamide 2-thioxo-1H-indole-3-carboxamide deriv. 14
Type:
Small organic molecule
Emp. Form.:
C23H20N2OS2
Mol. Mass.:
404.548
SMILES:
Cn1c(SSCc2ccccc2)c(C(=O)Nc2ccccc2)c2ccccc12
:
Substrate
Name:
poly(E,Y)
Synonyms:
Type:
Random Polymer
Mol. Mass.:
358.43
Organism:
Description:
poly[(glu)4(tyr)l]. 5 uM ATP containing 0.2 uCi 32P labeled ATP as co-substrate.
Residue:
3
NA