Target
Xylosyl- and glucuronyltransferase LARGE1
Ligand
BDBM67159
Substrate
EC50
6560±n/a nM
Citation
 PubChem, PC Dose response confirmation of small molecule activators of alpha dystroglycan glycosylation PubChem Bioassay (2012)[AID] 
Target
Name:
Xylosyl- and glucuronyltransferase LARGE1
Synonyms:
KIAA0609 LARGE | LARGE1
Type:
Enzyme Catalytic Domain
Mol. Mass.:
88079.63
Organism:
Homo sapiens (Human)
Description:
gi_47678551
Residue:
756
  
Inhibitor
Name:
BDBM67159
Synonyms:
2-(2,3-diketoindolin-1-yl)acetic acid isopropyl ester MLS000550130 cid_4328866 propan-2-yl 2-(2,3-dioxoindol-1-yl)acetate | propan-2-yl 2-[2,3-bis(oxidanylidene)indol-1-yl]ethanoate
Type:
Small organic molecule
Emp. Form.:
C13H13NO4
Mol. Mass.:
247.2466
SMILES:
CC(C)OC(=O)CN1C(=O)C(=O)c2ccccc12
: