Target
Hepatocyte nuclear factor 4-alpha
Ligand
BDBM52920
Substrate
IC50
2561±n/a nM
Citation
 PubChem, PC Counterscreen for inhibitors of the interaction of the lipase co-activator protein, abhydrolase domain containing 5 (ABHD5) with perilipin-5 (MLDP; PLIN5): Luminescence-based biochemical high throughput dose response assay to identify inhibitors of Hepatocyte nuclear factor 4 (HNF4) dimerization PubChem Bioassay (2012)[AID] 
Target
Name:
Hepatocyte nuclear factor 4-alpha
Synonyms:
HNF4 HNF4A_HUMAN TCF14 | hepatocyte nuclear factor 4-alpha isoform b
Type:
PROTEIN
Mol. Mass.:
52790.24
Organism:
Homo sapiens (Human)
Description:
ChEMBL_606516
Residue:
474
  
Inhibitor
Name:
BDBM52920
Synonyms:
(5E)-5-[(E)-3-(2-furanyl)prop-2-enylidene]-1-methyl-2-sulfanylidene-1,3-diazinane-4,6-dione (5E)-5-[(E)-3-(furan-2-yl)prop-2-enylidene]-1-methyl-2-sulfanylidene-1,3-diazinane-4,6-dione MLS000779344 cid_1906043
Type:
Small organic molecule
Emp. Form.:
C12H10N2O3S
Mol. Mass.:
262.284
SMILES:
CN1C(=S)NC(=O)\C(=C/C=C/c2ccco2)C1=O
: