Target
Hepatocyte nuclear factor 4-alpha
Ligand
BDBM94632
Substrate
IC50
2244±n/a nM
Citation
 PubChem, PC Counterscreen for inhibitors of the interaction of the lipase co-activator protein, abhydrolase domain containing 5 (ABHD5) with perilipin-5 (MLDP; PLIN5): Luminescence-based biochemical high throughput dose response assay to identify inhibitors of Hepatocyte nuclear factor 4 (HNF4) dimerization PubChem Bioassay (2012)[AID] 
Target
Name:
Hepatocyte nuclear factor 4-alpha
Synonyms:
HNF4 HNF4A_HUMAN TCF14 | hepatocyte nuclear factor 4-alpha isoform b
Type:
PROTEIN
Mol. Mass.:
52790.24
Organism:
Homo sapiens (Human)
Description:
ChEMBL_606516
Residue:
474
  
Inhibitor
Name:
BDBM94632
Synonyms:
2-(2-fluorophenyl)-2-[3-(2-furanyl)-2-oxo-1-quinoxalinyl]-N-(phenylmethyl)acetamide MLS003674181 N-benzyl-2-(2-fluorophenyl)-2-[3-(furan-2-yl)-2-oxoquinoxalin-1-yl]acetamide cid_53383162
Type:
Small organic molecule
Emp. Form.:
C27H20FN3O3
Mol. Mass.:
453.4644
SMILES:
Fc1ccccc1C(C(=O)NCc1ccccc1)n1c2ccccc2nc(-c2ccco2)c1=O
: