Target
Cytochrome P450 11B2, mitochondrial
Ligand
BDBM279766
Substrate
Meas. Tech.
G-402 cell line assay
EC50
0.075±n/a nM
Citation
 Aebi, JAmrein, KEChen, JHornsperger, BKuhn, BLiu, YLi, DMaerki, HPMartin, REMayweg, ATan, XWu, JYu, J Spirodiamine derivatives as aldosterone synthase inhibitors US Patent  US10035804 Publication Date 7/31/2018 
Target
Name:
Cytochrome P450 11B2, mitochondrial
Synonyms:
Aldosterone Synthase (CYP11B2) Aldosterone-synthesizing enzyme CYP11B2 Cytochrome P450 11B2 Cytochrome P450 11B2, mitochondrial P-450C18 | Steroid 18-hydroxylase
Type:
Protein
Mol. Mass.:
57582.15
Organism:
Homo sapiens (Human)
Description:
P19099
Residue:
503
  
Inhibitor
Name:
BDBM279766
Synonyms:
US10035804, Example 37
Type:
Small organic molecule
Emp. Form.:
C26H25ClN6O3
Mol. Mass.:
504.968
SMILES:
COc1nccnc1C(=O)N1CC2(C1)CN(C2)c1cncc(c1)N1C(=O)c2ccc(Cl)cc2C1(C)C
: