Target
ADP-ribosylation factor GTPase-activating protein 1
Ligand
BDBM40512
Substrate
IC50
43962±n/a nM
Citation
 PubChem, PC Fluorescence polarization-based biochemical high throughput dose response screening assay to identify inhibitors of ADP-ribosylation factor GTPase activating protein 1 (ARFGAP1) PubChem Bioassay (2012)[AID] 
Target
Name:
ADP-ribosylation factor GTPase-activating protein 1
Synonyms:
ARFG1_RAT Arfgap1
Type:
Enzyme Catalytic Domain
Mol. Mass.:
45436.38
Organism:
Rattus norvegicus
Description:
gi_21489979
Residue:
415
  
Inhibitor
Name:
BDBM40512
Synonyms:
2-({3-[2-(3,4-dimethoxyphenyl)ethyl]-4-oxo-3,4-dihydrothieno[3,2-d]pyrimidin-2-yl}thio)-N-(5-methylisoxazol-3-yl)acetamide 2-[3-[2-(3,4-dimethoxyphenyl)ethyl]-4-oxidanylidene-thieno[3,2-d]pyrimidin-2-yl]sulfanyl-N-(5-methyl-1,2-oxazol-3-yl)ethanamide 2-[[3-[2-(3,4-dimethoxyphenyl)ethyl]-4-oxo-2-thieno[3,2-d]pyrimidinyl]thio]-N-(5-methyl-3-isoxazolyl)acetamide SMR000031125 | cid_3242940
Type:
Small organic molecule
Emp. Form.:
C22H22N4O5S2
Mol. Mass.:
486.564
SMILES:
COc1ccc(CCn2c(SCC(=O)Nc3cc(C)on3)nc3ccsc3c2=O)cc1OC
: