Target
ADP-ribosylation factor GTPase-activating protein 1
Ligand
BDBM88864
Substrate
IC50
23837±n/a nM
Citation
 PubChem, PC Fluorescence polarization-based biochemical high throughput dose response screening assay to identify inhibitors of ADP-ribosylation factor GTPase activating protein 1 (ARFGAP1) PubChem Bioassay (2012)[AID] 
Target
Name:
ADP-ribosylation factor GTPase-activating protein 1
Synonyms:
ARFG1_RAT Arfgap1
Type:
Enzyme Catalytic Domain
Mol. Mass.:
45436.38
Organism:
Rattus norvegicus
Description:
gi_21489979
Residue:
415
  
Inhibitor
Name:
BDBM88864
Synonyms:
2-(2,4-Dichloro-benzylsulfanyl)-6,7,8,9-tetrahydro-pyrimido[4,5-b]quinolin-4-ylamine 2-[(2,4-dichlorophenyl)methylthio]-6,7,8,9-tetrahydropyrimido[4,5-b]quinolin-4-amine SMR000219822 cid_1992940
Type:
Small organic molecule
Emp. Form.:
C18H16Cl2N4S
Mol. Mass.:
391.317
SMILES:
Nc1nc(SCc2ccc(Cl)cc2Cl)nc2nc3CCCCc3cc12
: