Target
Nuclear receptor subfamily 5 group A member 2
Ligand
BDBM68466
Substrate
IC50
11066±n/a nM
Citation
 PubChem, PC Luminescence-based cell-based high throughput dose response assay for inverse agonists of the liver receptor homolog-1 (LRH-1; NR5A2) PubChem Bioassay (2013)[AID] 
Target
Name:
Nuclear receptor subfamily 5 group A member 2
Synonyms:
Alpha-1-fetoprotein transcription factor B1F CYP7A promoter-binding factor Hepatocytic transcription factor Liver Receptor Homolog 1 NR5A2_HUMAN hB1F | nuclear receptor subfamily 5 group A member 2 isoform 2
Type:
Nuclear Hormone Receptor
Mol. Mass.:
61341.37
Organism:
Homo sapiens (Human)
Description:
Residue:
541
  
Inhibitor
Name:
BDBM68466
Synonyms:
2-[2,5-bis(oxidanylidene)pyrrolidin-1-yl]-N-(4-bromophenyl)ethanamide N-(4-bromophenyl)-2-(2,5-dioxo-1-pyrrolidinyl)acetamide N-(4-bromophenyl)-2-succinimido-acetamide cid_2083990
Type:
Small organic molecule
Emp. Form.:
C12H11BrN2O3
Mol. Mass.:
311.131
SMILES:
Brc1ccc(NC(=O)CN2C(=O)CCC2=O)cc1
: