Target
Nuclear receptor subfamily 5 group A member 2
Ligand
BDBM95497
Substrate
IC50
1672±n/a nM
Citation
 PubChem, PC Luminescence-based cell-based high throughput dose response assay for inverse agonists of the liver receptor homolog-1 (LRH-1; NR5A2) PubChem Bioassay (2013)[AID] 
Target
Name:
Nuclear receptor subfamily 5 group A member 2
Synonyms:
Alpha-1-fetoprotein transcription factor B1F CYP7A promoter-binding factor Hepatocytic transcription factor Liver Receptor Homolog 1 NR5A2_HUMAN hB1F | nuclear receptor subfamily 5 group A member 2 isoform 2
Type:
Nuclear Hormone Receptor
Mol. Mass.:
61341.37
Organism:
Homo sapiens (Human)
Description:
Residue:
541
  
Inhibitor
Name:
BDBM95497
Synonyms:
2-(3-Benzo[1,3]dioxol-5-ylmethyl-1-methyl-5-oxo-2-thioxo-imidazolidin-4-yl)-N-(4-propoxy-phenyl)-acetamide 2-[3-(1,3-benzodioxol-5-ylmethyl)-1-methyl-5-oxidanylidene-2-sulfanylidene-imidazolidin-4-yl]-N-(4-propoxyphenyl)ethanamide 2-[3-(1,3-benzodioxol-5-ylmethyl)-1-methyl-5-oxo-2-sulfanylideneimidazolidin-4-yl]-N-(4-propoxyphenyl)acetamide SMR000177501 | cid_3140303
Type:
Small organic molecule
Emp. Form.:
C23H25N3O5S
Mol. Mass.:
455.527
SMILES:
CCCOc1ccc(NC(=O)CC2N(Cc3ccc4OCOc4c3)C(=S)N(C)C2=O)cc1
: